Target
Cytochrome P450 2C23
Ligand
BDBM50290897
Substrate
Meas. Tech.
ChEBML_52078
IC50
5000±n/a nM
Citation
 Falck, JRBelosludtsev, YYReddy, KKReddy, KMShortt, MFChauhan, Kand, JHWei, S Eicosanoid biosynthesis: differential inhibition of cytochrome P450 epoxygenase and ω-hydroxylase Bioorg Med Chem Lett 7:3053-3056 (1997)    Article 
Target
Name:
Cytochrome P450 2C23
Synonyms:
CP2CN_RAT Cyp2c23
Type:
PROTEIN
Mol. Mass.:
56444.45
Organism:
Rattus norvegicus
Description:
ChEMBL_52078
Residue:
494
  
Inhibitor
Name:
BDBM50290897
Synonyms:
1-(2'-Hydroxymethyl-biphenyl-2-yl)-hepta-4,6-diyn-3-ol | CHEMBL105529
Type:
Small organic molecule
Emp. Form.:
C20H18O2
Mol. Mass.:
290.3557
SMILES:
OCc1ccccc1-c1ccccc1CCC(O)C#CC#C
: