Target
Calpain-1 catalytic subunit
Ligand
BDBM50073850
Substrate
Meas. Tech.
ChEBML_43661
IC50
11±n/a nM
Citation
 Chatterjee, SSenadhi, SBozyczko-Coyne, DSiman, RMallamo, JP Nonpeptidic inhibitors of recombinant human calpain I Bioorg Med Chem Lett 7:287-290 (1997)    Article 
Target
Name:
Calpain-1 catalytic subunit
Synonyms:
CAN1_HUMAN CAPN1 Calpain-1 (u-Calpain) Calpain1
Type:
Protein
Mol. Mass.:
81880.51
Organism:
Homo sapiens (Human)
Description:
Residue:
714
  
Inhibitor
Name:
BDBM50073850
Synonyms:
(S)-2-((S)-2-Benzyloxycarbonylamino-3-methyl-butyrylamino)-3-phenyl-propionic acid MDL-28170 [1-(1-Benzyl-2-oxo-ethylcarbamoyl)-2-methyl-propyl]-carbamic acid benzyl ester benzyl (2S)-3-methyl-1-oxo-1-(1-oxo-3-phenylpropan-2-ylamino)butan-2-ylcarbamate | benzyl (S)-3-methyl-1-oxo-1-(1-oxo-3-phenylpropan-2-ylamino)butan-2-ylcarbamate
Type:
Small organic molecule
Emp. Form.:
C22H26N2O4
Mol. Mass.:
382.4528
SMILES:
CC(C)[C@H](NC(=O)OCc1ccccc1)C(=O)NC(Cc1ccccc1)C=O
: