Target
Gag-Pol polyprotein [489-587]
Ligand
BDBM50291057
Substrate
Meas. Tech.
ChEBML_157558
Ki
1.9±n/a nM
Citation
 Schwartz, TMBundy, GLStrohbach, JWThaisrivongs, SJohnson, PDSkulnick, HITomich, PKLynn, JCChong, KTHinshaw, RRRaub, TJPadbury, GEToth, LN Synthesis and pharmacological evaluation of sulfone substituted HIV protease inhibitors Bioorg Med Chem Lett 7:399-402 (1997)    Article 
Target
Name:
Gag-Pol polyprotein [489-587]
Synonyms:
Human immunodeficiency virus type 1 protease Pol polyprotein | gag-pol
Type:
Enzyme Subunit
Mol. Mass.:
10781.16
Organism:
Human immunodeficiency virus type 1
Description:
P04585[489-587]
Residue:
99
  
Inhibitor
Name:
BDBM50291057
Synonyms:
4-{3-[Cyclopropyl-(4-hydroxy-2-oxo-5,6,7,8,9,10-hexahydro-2H-cycloocta[b]pyran-3-yl)-methyl]-phenylmethanesulfonyl}-benzonitrile | CHEMBL131128
Type:
Small organic molecule
Emp. Form.:
C29H29NO5S
Mol. Mass.:
503.609
SMILES:
Oc1c2CCCCCCc2oc(=O)c1C(C1CC1)c1cccc(CS(=O)(=O)c2ccc(cc2)C#N)c1
: