Target
Interleukin-8
Ligand
BDBM50291130
Substrate
Meas. Tech.
ChEBML_89094
Ki
14000±n/a nM
Citation
 Attwood, MRConway, EADunsdon, RMGreening, JRHanda, BKJones, PSJordan, SCKeech, EWilson, FX Peptide based inhibitors of interleukin-8: structural simplification and enhanced potency Bioorg Med Chem Lett 7:429-432 (1997)    Article 
Target
Name:
Interleukin-8
Synonyms:
CXCL8 IL8_HUMAN interleukin 8 precursor
Type:
PROTEIN
Mol. Mass.:
11104.05
Organism:
Homo sapiens (Human)
Description:
ChEMBL_577736
Residue:
99
  
Inhibitor
Name:
BDBM50291130
Synonyms:
CHEMBL3856130 Interleukin-8 inhibitor, 12
Type:
Small organic molecule
Emp. Form.:
C91H121N19O32S2
Mol. Mass.:
2057.173
SMILES:
CSCC[C@H](NC(C)=O)C(=O)N[C@@H](Cc1c[nH]c2ccccc12)C(=O)N[C@@H](CC(O)=O)C(=O)N[C@@H](Cc1ccccc1)C(=O)N[C@@H](CC(O)=O)C(=O)N[C@@H](CC(O)=O)C(=O)NCCCC(=O)N[C@@H](CCSC)C(=O)N1CCC[C@H]1C(=O)N1CCC[C@H]1C(=O)N[C@@H](C)C(=O)N[C@@H](CC(O)=O)C(=O)N[C@@H](CCC(O)=O)C(=O)N[C@@H](CC(O)=O)C(=O)N[C@@H](Cc1ccc(O)cc1)C(=O)N[C@@H](CO)C(=O)N1CCC[C@H]1C(N)=O
: