Target
Sucrase-isomaltase, intestinal
Ligand
BDBM50292389
Substrate
Meas. Tech.
ChEMBL_550868 (CHEMBL1007667)
IC50
6000±n/a nM
Citation
 Kato, AAsano, NKizu, HMatsui, K Fagomine isomers and glycosides from Xanthocercis zambesiaca. J Nat Prod 60:312-4 (1997)  
Target
Name:
Sucrase-isomaltase, intestinal
Synonyms:
SUIS_RAT Sucrase-isomaltase | alpha-Glucosidase (α-Glucosidase)
Type:
Enzyme
Mol. Mass.:
210329.04
Organism:
Rattus norvegicus (Rat)
Description:
P23739
Residue:
1841
  
Inhibitor
Name:
BDBM50292389
Synonyms:
3-epi-fagomine CHEMBL456583
Type:
Small organic molecule
Emp. Form.:
C6H13NO3
Mol. Mass.:
147.1723
SMILES:
OC[C@H]1NCC[C@H](O)[C@@H]1O
: