Target
Epidermal growth factor receptor
Ligand
BDBM50007082
Substrate
Meas. Tech.
ChEMBL_506200 (CHEMBL941404)
IC50
8000±n/a nM
Citation
 Chang, CJGeahlen, RL Protein-Tyrosine Kinase Inhibition: Mechanism-Based Discovery of Antitumor Agents J Nat Prod 55:1529-1560 (1992)  
Target
Name:
Epidermal growth factor receptor
Synonyms:
EGF Receptor Substrate EGFR_HUMAN ERBB1 Epidermal Growth Factor Receptor erbB-1 Epidermal growth factor receptor (EGFR) HER1 Proto-oncogene c-ErbB-1 Tyrosine-Protein Kinase ErbB-1
Type:
Receptor Kinase Domain
Mol. Mass.:
134279.59
Organism:
Homo sapiens (Human)
Description:
P00533
Residue:
1210
  
Inhibitor
Name:
BDBM50007082
Synonyms:
(E)-2-methoxy-4-(2-nitrovinyl)phenol 2-methoxy-4-(2-nitrovinyl)phenol cid_638439
Type:
Small organic molecule
Emp. Form.:
C9H9NO4
Mol. Mass.:
195.1721
SMILES:
COc1cc(\C=C\[N+]([O-])=O)ccc1O
: