Target
Epidermal growth factor receptor
Ligand
BDBM50292523
Substrate
Meas. Tech.
ChEMBL_506200 (CHEMBL941404)
IC50
10000±n/a nM
Citation
 Chang, CJGeahlen, RL Protein-Tyrosine Kinase Inhibition: Mechanism-Based Discovery of Antitumor Agents J Nat Prod 55:1529-1560 (1992)  
Target
Name:
Epidermal growth factor receptor
Synonyms:
EGF Receptor Substrate EGFR_HUMAN ERBB1 Epidermal Growth Factor Receptor erbB-1 Epidermal growth factor receptor (EGFR) HER1 Proto-oncogene c-ErbB-1 Tyrosine-Protein Kinase ErbB-1
Type:
Receptor Kinase Domain
Mol. Mass.:
134279.59
Organism:
Homo sapiens (Human)
Description:
P00533
Residue:
1210
  
Inhibitor
Name:
BDBM50292523
Synonyms:
2-(3,4-dihydroxyphenyl)ethene-1,1,2-tricarbonitrile RG-50810
Type:
Small organic molecule
Emp. Form.:
C11H5N3O2
Mol. Mass.:
211.1763
SMILES:
[#8]-c1ccc(cc1-[#8])-[#6](\C#N)=[#6](\C#N)C#N
: