Target
Ribonuclease pancreatic
Ligand
BDBM50292722
Substrate
Meas. Tech.
ChEMBL_493877 (CHEMBL944248)
Ki
82000±n/a nM
Citation
 Samanta, ALeonidas, DDDasgupta, SPathak, TZographos, SEOikonomakos, NG Morpholino, piperidino, and pyrrolidino derivatives of pyrimidine nucleosides as inhibitors of ribonuclease A: synthesis, biochemical, and crystallographic evaluation. J Med Chem 52:932-42 (2009)  
Target
Name:
Ribonuclease pancreatic
Synonyms:
CAM-RNase A RNASE1 RNS1
Type:
Enzyme
Mol. Mass.:
16468.79
Organism:
Bison bison (American bison)
Description:
carboxamidomethylated RNase A
Residue:
150
  
Inhibitor
Name:
BDBM50292722
Synonyms:
3'-UMP CHEMBL460741
Type:
Small organic molecule
Emp. Form.:
C9H13N2O9P
Mol. Mass.:
324.1813
SMILES:
OC[C@H]1O[C@H]([C@H](O)[C@@H]1OP(O)(O)=O)n1ccc(=O)[nH]c1=O
: