Target
4,4'-diapophytoene synthase
Ligand
BDBM50292852
Substrate
Meas. Tech.
ChEMBL_494370 (CHEMBL941163)
IC50
2100±n/a nM
Citation
 Song, YLin, FYYin, FHensler, MRodrígues Poveda, CAMukkamala, DCao, RWang, HMorita, CTGonzález Pacanowska, DNizet, VOldfield, E Phosphonosulfonates are potent, selective inhibitors of dehydrosqualene synthase and staphyloxanthin biosynthesis in Staphylococcus aureus. J Med Chem 52:976-88 (2009)  
Target
Name:
4,4'-diapophytoene synthase
Synonyms:
CRTM_STAAU crtM
Type:
PROTEIN
Mol. Mass.:
34309.10
Organism:
Staphylococcus aureus
Description:
ChEMBL_1352846
Residue:
287
  
Inhibitor
Name:
BDBM50292852
Synonyms:
1-Phosphono-4-[3-(benzofuran-5-yloxy)phenyl]butylsulfonic Acid Tripotassium Salt | CHEMBL490300
Type:
Small organic molecule
Emp. Form.:
C18H16O8PS
Mol. Mass.:
423.355
SMILES:
[O-]P([O-])(=O)C(CCCc1cccc(Oc2ccc3occc3c2)c1)S([O-])(=O)=O
: