Target
4,4'-diapophytoene synthase
Ligand
BDBM50292859
Substrate
Meas. Tech.
ChEMBL_494370 (CHEMBL941163)
IC50
10500±n/a nM
Citation
 Song, YLin, FYYin, FHensler, MRodrígues Poveda, CAMukkamala, DCao, RWang, HMorita, CTGonzález Pacanowska, DNizet, VOldfield, E Phosphonosulfonates are potent, selective inhibitors of dehydrosqualene synthase and staphyloxanthin biosynthesis in Staphylococcus aureus. J Med Chem 52:976-88 (2009)  
Target
Name:
4,4'-diapophytoene synthase
Synonyms:
CRTM_STAAU crtM
Type:
PROTEIN
Mol. Mass.:
34309.10
Organism:
Staphylococcus aureus
Description:
ChEMBL_1352846
Residue:
287
  
Inhibitor
Name:
BDBM50292859
Synonyms:
1-Phosphono-4-[3-(4-tert-butylphenoxy)phenyl]butylsulfonic Acid Tripotassium Salt | CHEMBL473742
Type:
Small organic molecule
Emp. Form.:
C20H24O7PS
Mol. Mass.:
439.441
SMILES:
CC(C)(C)c1ccc(Oc2cccc(CCCC(P([O-])([O-])=O)S([O-])(=O)=O)c2)cc1
: