Target
4,4'-diapophytoene synthase
Ligand
BDBM50292872
Substrate
Meas. Tech.
ChEMBL_494370 (CHEMBL941163)
IC50
9100±n/a nM
Citation
 Song, YLin, FYYin, FHensler, MRodrígues Poveda, CAMukkamala, DCao, RWang, HMorita, CTGonzález Pacanowska, DNizet, VOldfield, E Phosphonosulfonates are potent, selective inhibitors of dehydrosqualene synthase and staphyloxanthin biosynthesis in Staphylococcus aureus. J Med Chem 52:976-88 (2009)  
Target
Name:
4,4'-diapophytoene synthase
Synonyms:
CRTM_STAAU crtM
Type:
PROTEIN
Mol. Mass.:
34309.10
Organism:
Staphylococcus aureus
Description:
ChEMBL_1352846
Residue:
287
  
Inhibitor
Name:
BDBM50292872
Synonyms:
1-Phosphono-4-[4-(2,4-difluorophenyl)phenyl]butylsulfonic Acid Tripotassium Salt | CHEMBL516975
Type:
Small organic molecule
Emp. Form.:
C16H14F2O6PS
Mol. Mass.:
403.316
SMILES:
[O-]P([O-])(=O)C(CCCc1ccc(cc1)-c1ccc(F)cc1F)S([O-])(=O)=O
: