Target
Glycogen synthase kinase-3 beta
Ligand
BDBM7393
Substrate
Meas. Tech.
ChEMBL_570959 (CHEMBL1034478)
IC50
22±n/a nM
Citation
 Vadivelan, SSinha, BNTajne, SJagarlapudi, SA Fragment and knowledge-based design of selective GSK-3beta inhibitors using virtual screening models. Eur J Med Chem 44:2361-71 (2009)  
Target
Name:
Glycogen synthase kinase-3 beta
Synonyms:
GSK-3 beta GSK3B Glycogen synthase kinase 3 beta (GSK3B) Glycogen synthase kinase-3 beta (GSK-3B) Glycogen synthase kinase-3 beta (GSK3B) Glycogen synthase kinase-3beta (GSK3B) | Serine/threonine-protein kinase GSK3B
Type:
Enzyme
Mol. Mass.:
46756.38
Organism:
Homo sapiens (Human)
Description:
P49841
Residue:
420
  
Inhibitor
Name:
BDBM7393
Synonyms:
3-[(2Z,3E)-3-(hydroxyimino)-2,3-dihydro-1H-indol-2-ylidene]-2,3-dihydro-1H-indol-2-one Indirubin-3 -monoxime Indirubin-3monoxime | indirubin deriv. 7h
Type:
Emp. Form.:
C16H11N3O2
Mol. Mass.:
277.2774
SMILES:
O=Nc1c([nH]c2ccccc12)C1C(=O)Nc2ccccc12
: