Target
Melanin-concentrating hormone receptor 1
Ligand
BDBM50293477
Substrate
Meas. Tech.
ChEMBL_570542 (CHEMBL1026914)
Ki
133±n/a nM
Citation
 Abu-Hammad, AZalloum, WAZalloum, HAbu-Sheikha, GTaha, MO Homology modeling of MCH1 receptor and validation by docking/scoring and protein-aligned CoMFA. Eur J Med Chem 44:2583-96 (2009)  
Target
Name:
Melanin-concentrating hormone receptor 1
Synonyms:
G-protein coupled receptor 24 MCH receptor 1 MCH-R1 MCHR-1 MCHR1_HUMAN Melanin-Concentrating Hormone Receptor 1 (MCH1R) Melanin-concentrating hormone receptor 1 (MCH-1) Melanin-concentrating hormone receptor 1 (MCHR-1) SLC-1 Somatostatin receptor-like protein
Type:
G Protein-Coupled Receptor (GPCR)
Mol. Mass.:
45976.27
Organism:
Homo sapiens (Human)
Description:
Membranes from CHO-K1 cells stably expressing human MCH1R were used in assays.
Residue:
422
  
Inhibitor
Name:
BDBM50293477
Synonyms:
1-(4-((1-(benzo[d][1,3]dioxol-5-ylmethyl)piperidin-4-yl)methyl)phenyl)-2-(2,3-dihydrobenzofuran-5-yl)ethanone | CHEMBL563223
Type:
Small organic molecule
Emp. Form.:
C30H31NO4
Mol. Mass.:
469.5714
SMILES:
O=C(Cc1ccc2OCCc2c1)c1ccc(CC2CCN(Cc3ccc4OCOc4c3)CC2)cc1
: