Target
Melanin-concentrating hormone receptor 1
Ligand
BDBM50293482
Substrate
Meas. Tech.
ChEMBL_570542 (CHEMBL1026914)
Ki
149±n/a nM
Citation
 Abu-Hammad, AZalloum, WAZalloum, HAbu-Sheikha, GTaha, MO Homology modeling of MCH1 receptor and validation by docking/scoring and protein-aligned CoMFA. Eur J Med Chem 44:2583-96 (2009)  
Target
Name:
Melanin-concentrating hormone receptor 1
Synonyms:
G-protein coupled receptor 24 MCH receptor 1 MCH-R1 MCHR-1 MCHR1_HUMAN Melanin-Concentrating Hormone Receptor 1 (MCH1R) Melanin-concentrating hormone receptor 1 (MCH-1) Melanin-concentrating hormone receptor 1 (MCHR-1) SLC-1 Somatostatin receptor-like protein
Type:
G Protein-Coupled Receptor (GPCR)
Mol. Mass.:
45976.27
Organism:
Homo sapiens (Human)
Description:
Membranes from CHO-K1 cells stably expressing human MCH1R were used in assays.
Residue:
422
  
Inhibitor
Name:
BDBM50293482
Synonyms:
(R)-N-(1-(4-bromophenyl)ethyl)-4-((1-(4-methoxybenzyl)piperidin-4-ylidene)methyl)benzamide | CHEMBL561694
Type:
Small organic molecule
Emp. Form.:
C29H31BrN2O2
Mol. Mass.:
519.473
SMILES:
[#6]-[#8]-c1ccc(-[#6]-[#7]-2-[#6]-[#6]\[#6](-[#6]-[#6]-2)=[#6]/c2ccc(cc2)-[#6](=O)-[#7]-[#6@H](-[#6])-c2ccc(Br)cc2)cc1
: