Target
Kinesin-like protein KIF11
Ligand
BDBM50293748
Substrate
Meas. Tech.
ChEMBL_571916 (CHEMBL1035565)
IC50
20000±n/a nM
Citation
 Lahue, BRMa, YShipps, GWSeghezzi, WHerbst, R Substituted benzimidazoles: A novel chemotype for small molecule hKSP inhibitors. Bioorg Med Chem Lett 19:3405-9 (2009)  
Target
Name:
Kinesin-like protein KIF11
Synonyms:
EG5 KIF11_HUMAN Kinesin Spindle Protein Eg5 TRIP5 | kinesin spindle protein
Type:
PROTEIN
Mol. Mass.:
119138.97
Organism:
Homo sapiens (Human)
Description:
ChEMBL_1457426
Residue:
1056
  
Inhibitor
Name:
BDBM50293748
Synonyms:
1-(2-methoxybenzyl)-2-(4-sulfamoylphenylamino)-1H-benzo[d]imidazole-5-carboxamide | CHEMBL560558
Type:
Small organic molecule
Emp. Form.:
C22H21N5O4S
Mol. Mass.:
451.498
SMILES:
COc1ccccc1Cn1c(Nc2ccc(cc2)S(N)(=O)=O)nc2cc(ccc12)C(N)=O
: