Target
Kinesin-like protein KIF11
Ligand
BDBM50293749
Substrate
Meas. Tech.
ChEMBL_571916 (CHEMBL1035565)
IC50
5000±n/a nM
Citation
 Lahue, BRMa, YShipps, GWSeghezzi, WHerbst, R Substituted benzimidazoles: A novel chemotype for small molecule hKSP inhibitors. Bioorg Med Chem Lett 19:3405-9 (2009)  
Target
Name:
Kinesin-like protein KIF11
Synonyms:
EG5 KIF11_HUMAN Kinesin Spindle Protein Eg5 TRIP5 | kinesin spindle protein
Type:
PROTEIN
Mol. Mass.:
119138.97
Organism:
Homo sapiens (Human)
Description:
ChEMBL_1457426
Residue:
1056
  
Inhibitor
Name:
BDBM50293749
Synonyms:
1-(2,3-dimethoxybenzyl)-2-(4-sulfamoylphenylamino)-1H-benzo[d]imidazole-5-carboxamide | CHEMBL564451
Type:
Small organic molecule
Emp. Form.:
C23H23N5O5S
Mol. Mass.:
481.524
SMILES:
COc1cccc(Cn2c(Nc3ccc(cc3)S(N)(=O)=O)nc3cc(ccc23)C(N)=O)c1OC
: