Target
Kinesin-like protein KIF11
Ligand
BDBM50293750
Substrate
Meas. Tech.
ChEMBL_571916 (CHEMBL1035565)
IC50
>20000±n/a nM
Citation
 Lahue, BRMa, YShipps, GWSeghezzi, WHerbst, R Substituted benzimidazoles: A novel chemotype for small molecule hKSP inhibitors. Bioorg Med Chem Lett 19:3405-9 (2009)  
Target
Name:
Kinesin-like protein KIF11
Synonyms:
EG5 KIF11_HUMAN Kinesin Spindle Protein Eg5 TRIP5 | kinesin spindle protein
Type:
PROTEIN
Mol. Mass.:
119138.97
Organism:
Homo sapiens (Human)
Description:
ChEMBL_1457426
Residue:
1056
  
Inhibitor
Name:
BDBM50293750
Synonyms:
1-(benzo[d]thiazol-2-ylmethyl)-2-(4-sulfamoylphenylamino)-1H-benzo[d]imidazole-5-carboxamide | CHEMBL559508
Type:
Small organic molecule
Emp. Form.:
C22H18N6O3S2
Mol. Mass.:
478.547
SMILES:
NC(=O)c1ccc2n(Cc3nc4ccccc4s3)c(Nc3ccc(cc3)S(N)(=O)=O)nc2c1
: