Target
Cytochrome P450 2D6
Ligand
BDBM50293754
Substrate
Meas. Tech.
ChEMBL_571926 (CHEMBL1035575)
IC50
>15000±n/a nM
Citation
 Lahue, BRMa, YShipps, GWSeghezzi, WHerbst, R Substituted benzimidazoles: A novel chemotype for small molecule hKSP inhibitors. Bioorg Med Chem Lett 19:3405-9 (2009)  
Target
Name:
Cytochrome P450 2D6
Synonyms:
CP2D6_HUMAN CYP2DL1 Cytochrome P450 2D6 (CYP2D6) P450-DB1
Type:
Protein
Mol. Mass.:
55774.82
Organism:
Homo sapiens (Human)
Description:
P10635
Residue:
497
  
Inhibitor
Name:
BDBM50293754
Synonyms:
2-(4-methoxyphenylamino)-1-(2-(trifluoromethyl)benzyl)-1H-benzo[d]imidazole-5-carboxamide | CHEMBL557885
Type:
Small organic molecule
Emp. Form.:
C23H19F3N4O2
Mol. Mass.:
440.4178
SMILES:
COc1ccc(Nc2nc3cc(ccc3n2Cc2ccccc2C(F)(F)F)C(N)=O)cc1
: