Target
Corticotropin-releasing factor receptor 1
Ligand
BDBM50293950
Substrate
Meas. Tech.
ChEMBL_572726 (CHEMBL1030150)
IC50
76±n/a nM
Citation
 Hartz, RAAhuja, VTArvanitis, AGRafalski, MYue, EWDenhart, DJSchmitz, WDDitta, JLDeskus, JABrenner, ABHobbs, FWPayne, JLelas, SLi, YWMolski, TFMattson, GKPeng, YWong, HGrace, JELentz, KAQian-Cutrone, JZhuo, XShu, YZLodge, NJZaczek, RCombs, APOlson, REBronson, JJMattson, RJMacor, JE Synthesis, structure-activity relationships, and in vivo evaluation of N3-phenylpyrazinones as novel corticotropin-releasing factor-1 (CRF1) receptor antagonists. J Med Chem 52:4173-91 (2009)  
Target
Name:
Corticotropin-releasing factor receptor 1
Synonyms:
CRF-R CRFR1_RAT Corticotropin releasing factor receptor Corticotropin-releasing Factor Receptor 1 Crhr | Crhr1
Type:
G Protein-Coupled Receptor (GPCR)
Mol. Mass.:
47870.75
Organism:
Rattus norvegicus (rat)
Description:
Receptor binding assays were performed using rat cortex homogenate.
Residue:
415
  
Inhibitor
Name:
BDBM50293950
Synonyms:
5-Chloro-1-(2-ethylbutyl)-3-(4-methoxy-2,5-dimethylphenylamino)pyrazin-2(1H)-one | CHEMBL562435
Type:
Small organic molecule
Emp. Form.:
C19H26ClN3O2
Mol. Mass.:
363.882
SMILES:
CCC(CC)Cn1cc(Cl)nc(Nc2cc(C)c(OC)cc2C)c1=O
: