Target
Corticotropin-releasing factor receptor 1
Ligand
BDBM50293931
Substrate
Meas. Tech.
ChEMBL_572726 (CHEMBL1030150)
IC50
2.4±n/a nM
Citation
 Hartz, RAAhuja, VTArvanitis, AGRafalski, MYue, EWDenhart, DJSchmitz, WDDitta, JLDeskus, JABrenner, ABHobbs, FWPayne, JLelas, SLi, YWMolski, TFMattson, GKPeng, YWong, HGrace, JELentz, KAQian-Cutrone, JZhuo, XShu, YZLodge, NJZaczek, RCombs, APOlson, REBronson, JJMattson, RJMacor, JE Synthesis, structure-activity relationships, and in vivo evaluation of N3-phenylpyrazinones as novel corticotropin-releasing factor-1 (CRF1) receptor antagonists. J Med Chem 52:4173-91 (2009)  
Target
Name:
Corticotropin-releasing factor receptor 1
Synonyms:
CRF-R CRFR1_RAT Corticotropin releasing factor receptor Corticotropin-releasing Factor Receptor 1 Crhr | Crhr1
Type:
G Protein-Coupled Receptor (GPCR)
Mol. Mass.:
47870.75
Organism:
Rattus norvegicus (rat)
Description:
Receptor binding assays were performed using rat cortex homogenate.
Residue:
415
  
Inhibitor
Name:
BDBM50293931
Synonyms:
(R)-3,5-dichloro-4-(6-chloro-4-(1-cyclopropylethyl)-3-oxo-3,4-dihydropyrazin-2-ylamino)benzonitrile CHEMBL564303
Type:
Small organic molecule
Emp. Form.:
C16H13Cl3N4O
Mol. Mass.:
383.66
SMILES:
C[C@H](C1CC1)n1cc(Cl)nc(Nc2c(Cl)cc(cc2Cl)C#N)c1=O
: