Target
Corticotropin-releasing factor receptor 1
Ligand
BDBM50293981
Substrate
Meas. Tech.
ChEMBL_572726 (CHEMBL1030150)
IC50
0.62±n/a nM
Citation
 Hartz, RAAhuja, VTArvanitis, AGRafalski, MYue, EWDenhart, DJSchmitz, WDDitta, JLDeskus, JABrenner, ABHobbs, FWPayne, JLelas, SLi, YWMolski, TFMattson, GKPeng, YWong, HGrace, JELentz, KAQian-Cutrone, JZhuo, XShu, YZLodge, NJZaczek, RCombs, APOlson, REBronson, JJMattson, RJMacor, JE Synthesis, structure-activity relationships, and in vivo evaluation of N3-phenylpyrazinones as novel corticotropin-releasing factor-1 (CRF1) receptor antagonists. J Med Chem 52:4173-91 (2009)  
Target
Name:
Corticotropin-releasing factor receptor 1
Synonyms:
CRF-R CRFR1_RAT Corticotropin releasing factor receptor Corticotropin-releasing Factor Receptor 1 Crhr | Crhr1
Type:
G Protein-Coupled Receptor (GPCR)
Mol. Mass.:
47870.75
Organism:
Rattus norvegicus (rat)
Description:
Receptor binding assays were performed using rat cortex homogenate.
Residue:
415
  
Inhibitor
Name:
BDBM50293981
Synonyms:
(R)-5-Chloro-3-(7-chloro-5-methoxyindolin-1-yl)-1-(1-cyclopropylethyl)pyrazin-2(1H)-one | CHEMBL564588
Type:
Small organic molecule
Emp. Form.:
C18H19Cl2N3O2
Mol. Mass.:
380.268
SMILES:
COc1cc2CCN(c2c(Cl)c1)c1nc(Cl)cn([C@H](C)C2CC2)c1=O
: