Target
Corticotropin-releasing factor receptor 1
Ligand
BDBM50293988
Substrate
Meas. Tech.
ChEMBL_572726 (CHEMBL1030150)
IC50
6.7±n/a nM
Citation
 Hartz, RAAhuja, VTArvanitis, AGRafalski, MYue, EWDenhart, DJSchmitz, WDDitta, JLDeskus, JABrenner, ABHobbs, FWPayne, JLelas, SLi, YWMolski, TFMattson, GKPeng, YWong, HGrace, JELentz, KAQian-Cutrone, JZhuo, XShu, YZLodge, NJZaczek, RCombs, APOlson, REBronson, JJMattson, RJMacor, JE Synthesis, structure-activity relationships, and in vivo evaluation of N3-phenylpyrazinones as novel corticotropin-releasing factor-1 (CRF1) receptor antagonists. J Med Chem 52:4173-91 (2009)  
Target
Name:
Corticotropin-releasing factor receptor 1
Synonyms:
CRF-R CRFR1_RAT Corticotropin releasing factor receptor Corticotropin-releasing Factor Receptor 1 Crhr | Crhr1
Type:
G Protein-Coupled Receptor (GPCR)
Mol. Mass.:
47870.75
Organism:
Rattus norvegicus (rat)
Description:
Receptor binding assays were performed using rat cortex homogenate.
Residue:
415
  
Inhibitor
Name:
BDBM50293988
Synonyms:
(R)-4-(1-Cyclopropylethyl)-6-[6-methoxy-2-(trifluoromethyl)pyridin-3-ylamino]-5-oxo-4,5-dihydropyrazine-2-carbonitrile | CHEMBL563652
Type:
Small organic molecule
Emp. Form.:
C17H16F3N5O2
Mol. Mass.:
379.3364
SMILES:
COc1ccc(Nc2nc(cn([C@H](C)C3CC3)c2=O)C#N)c(n1)C(F)(F)F
: