Target
Corticotropin-releasing factor receptor 1
Ligand
BDBM50293990
Substrate
Meas. Tech.
ChEMBL_572726 (CHEMBL1030150)
IC50
180±n/a nM
Citation
 Hartz, RAAhuja, VTArvanitis, AGRafalski, MYue, EWDenhart, DJSchmitz, WDDitta, JLDeskus, JABrenner, ABHobbs, FWPayne, JLelas, SLi, YWMolski, TFMattson, GKPeng, YWong, HGrace, JELentz, KAQian-Cutrone, JZhuo, XShu, YZLodge, NJZaczek, RCombs, APOlson, REBronson, JJMattson, RJMacor, JE Synthesis, structure-activity relationships, and in vivo evaluation of N3-phenylpyrazinones as novel corticotropin-releasing factor-1 (CRF1) receptor antagonists. J Med Chem 52:4173-91 (2009)  
Target
Name:
Corticotropin-releasing factor receptor 1
Synonyms:
CRF-R CRFR1_RAT Corticotropin releasing factor receptor Corticotropin-releasing Factor Receptor 1 Crhr | Crhr1
Type:
G Protein-Coupled Receptor (GPCR)
Mol. Mass.:
47870.75
Organism:
Rattus norvegicus (rat)
Description:
Receptor binding assays were performed using rat cortex homogenate.
Residue:
415
  
Inhibitor
Name:
BDBM50293990
Synonyms:
(R)-1-(1-Cyclopropylethyl)-5-ethyl-3-[6-methoxy-2-(trifluoromethyl)pyridin-3-ylamino]pyrazin-2(1H)-one | CHEMBL561226
Type:
Small organic molecule
Emp. Form.:
C18H21F3N4O2
Mol. Mass.:
382.3801
SMILES:
CCc1cn([C@H](C)C2CC2)c(=O)c(Nc2ccc(OC)nc2C(F)(F)F)n1
: