Target
Inhibitor of nuclear factor kappa-B kinase subunit alpha
Ligand
BDBM50294686
Substrate
Meas. Tech.
ChEMBL_575816 (CHEMBL1025323)
IC50
22±n/a nM
Citation
 Kempson, JGuo, JDas, JMoquin, RVSpergel, SHWatterson, SHLangevine, CMDyckman, AJPattoli, MBurke, JRYang, XGillooly, KMMcIntyre, KWChen, LDodd, JHMcKinnon, MBarrish, JCPitts, WJ Synthesis, initial SAR and biological evaluation of 1,6-dihydroimidazo[4,5-d]pyrrolo[2,3-b]pyridin-4-amine derived inhibitors of IkappaB kinase. Bioorg Med Chem Lett 19:2646-9 (2009)  
Target
Name:
Inhibitor of nuclear factor kappa-B kinase subunit alpha
Synonyms:
CHUK I-kappa-B kinase 1 IKK-A IKK1 IKKA IkBKA Inhibitor of NF-kappa-B kinase alpha/beta Nuclear factor NF-kappa-B inhibitor kinase alpha TCF16 | Transcription factor 16
Type:
PROTEIN
Mol. Mass.:
84642.21
Organism:
Homo sapiens (Human)
Description:
ChEMBL_327453
Residue:
745
  
Inhibitor
Name:
BDBM50294686
Synonyms:
CHEMBL562370 | N1-(3-(1-methyl-4-(methylamino)-1,6-dihydroimidazo[4,5-d]pyrrolo[2,3-b]pyridin-7-yl)benzyl)succinamide
Type:
Small organic molecule
Emp. Form.:
C21H23N7O2
Mol. Mass.:
405.453
SMILES:
CNc1nc2[nH]c(cc2c2n(C)cnc12)-c1cccc(CNC(=O)CCC(N)=O)c1
: