Target
Cannabinoid receptor 1
Ligand
BDBM50295026
Substrate
Meas. Tech.
ChEMBL_577245 (CHEMBL1035355)
Ki
15±n/a nM
Citation
 Szabó, GVarga, BPáyer-Lengyel, DSzemzo, AErdélyi, PVukics, KSzikra, JHegyi, EVastag, MKiss, BLaszy, JGyertyán, IFischer, J Chemical and biological investigation of cyclopropyl containing diaryl-pyrazole-3-carboxamides as novel and potent cannabinoid type 1 receptor antagonists. J Med Chem 52:4329-37 (2009)  
Target
Name:
Cannabinoid receptor 1
Synonyms:
Brain-type cannabinoid receptor CB-R CNR1_RAT Cannabinoid receptor Cnr1 | Skr6
Type:
G Protein-Coupled Receptor (GPCR)
Mol. Mass.:
52856.55
Organism:
Rattus norvegicus (rat)
Description:
P20272
Residue:
473
  
Inhibitor
Name:
BDBM50295026
Synonyms:
5-(4-Cyclopentylphenyl)-1-(2,4-dichlorophenyl)-4-methyl-N-piperidin-1-yl-1-H-pyrazole-3-carboxamide | CHEMBL564705
Type:
Small organic molecule
Emp. Form.:
C27H30Cl2N4O
Mol. Mass.:
497.459
SMILES:
Cc1c(nn(c1-c1ccc(cc1)C1CCCC1)-c1ccc(Cl)cc1Cl)C(=O)NN1CCCCC1
: