Target
Cannabinoid receptor 1
Ligand
BDBM50295037
Substrate
Meas. Tech.
ChEMBL_577245 (CHEMBL1035355)
Ki
14±n/a nM
Citation
 Szabó, GVarga, BPáyer-Lengyel, DSzemzo, AErdélyi, PVukics, KSzikra, JHegyi, EVastag, MKiss, BLaszy, JGyertyán, IFischer, J Chemical and biological investigation of cyclopropyl containing diaryl-pyrazole-3-carboxamides as novel and potent cannabinoid type 1 receptor antagonists. J Med Chem 52:4329-37 (2009)  
Target
Name:
Cannabinoid receptor 1
Synonyms:
Brain-type cannabinoid receptor CB-R CNR1_RAT Cannabinoid receptor Cnr1 | Skr6
Type:
G Protein-Coupled Receptor (GPCR)
Mol. Mass.:
52856.55
Organism:
Rattus norvegicus (rat)
Description:
P20272
Residue:
473
  
Inhibitor
Name:
BDBM50295037
Synonyms:
5-(4-Cyclopropylphenyl)-1-(2-fluoro-4-chlorophenyl)-4-methyl-N-piperidin-1-yl-1H-pyrazole-3-carboxamide | CHEMBL560370
Type:
Small organic molecule
Emp. Form.:
C25H26ClFN4O
Mol. Mass.:
452.952
SMILES:
Cc1c(nn(c1-c1ccc(cc1)C1CC1)-c1ccc(Cl)cc1F)C(=O)NN1CCCCC1
: