Target
Sodium-dependent serotonin transporter
Ligand
BDBM50295053
Substrate
Meas. Tech.
ChEMBL_574191 (CHEMBL1060392)
IC50
145±n/a nM
Citation
 Zhou, DStack, GPLo, JFailli, AAEvrard, DAHarrison, BLHatzenbuhler, NTTran, MCroce, SYi, SGolembieski, JHornby, GALai, MLin, QSchechter, LESmith, DLShilling, ADHuselton, CMitchell, PBeyer, CEAndree, TH Synthesis, potency, and in vivo evaluation of 2-piperazin-1-ylquinoline analogues as dual serotonin reuptake inhibitors and serotonin 5-HT1A receptor antagonists. J Med Chem 52:4955-9 (2009)  
Target
Name:
Sodium-dependent serotonin transporter
Synonyms:
5-HT Transporter 5HTT SC6A4_HUMAN SLC6A4 Serotonin transporter (5HTT) Sodium-dependent serotonin transporter (SERT) | Solute carrier family 6 member 4
Type:
Multi-pass membrane protein
Mol. Mass.:
70322.51
Organism:
Homo sapiens (Human)
Description:
P31645
Residue:
630
  
Inhibitor
Name:
BDBM50295053
Synonyms:
(S)-2-((4-(1H-Indol-3-yl)-5,6-dihydropyridin-1(2H)-yl)-methyl)-8-methyl-2,3-dihydro-[1,4]dioxino-[2,3-f]quinoline | CHEMBL562248
Type:
Small organic molecule
Emp. Form.:
C26H25N3O2
Mol. Mass.:
411.4956
SMILES:
Cc1ccc2c3O[C@@H](CN4CCC(=CC4)c4c[nH]c5ccccc45)COc3ccc2n1
: