Target
5-hydroxytryptamine receptor 1A
Ligand
BDBM50295064
Substrate
Meas. Tech.
ChEMBL_574193 (CHEMBL1060394)
IC50
781±n/a nM
Citation
 Zhou, DStack, GPLo, JFailli, AAEvrard, DAHarrison, BLHatzenbuhler, NTTran, MCroce, SYi, SGolembieski, JHornby, GALai, MLin, QSchechter, LESmith, DLShilling, ADHuselton, CMitchell, PBeyer, CEAndree, TH Synthesis, potency, and in vivo evaluation of 2-piperazin-1-ylquinoline analogues as dual serotonin reuptake inhibitors and serotonin 5-HT1A receptor antagonists. J Med Chem 52:4955-9 (2009)  
Target
Name:
5-hydroxytryptamine receptor 1A
Synonyms:
5-HT-1A 5-hydroxytryptamine receptor 1A (5-HT-1A) ADRB2RL1 Dopamine D2 receptor and serotonin 1a receptor HTR1A | Serotonin receptor 1A
Type:
Mol. Mass.:
46122.49
Organism:
Homo sapiens (Human)
Description:
Residue:
422
  
Inhibitor
Name:
BDBM50295064
Synonyms:
(2S)-2-{[4-(6-Chloroquinolin-2-yl)piperazin-1-yl]methyl}-8-methyl-2,3-dihydro[1,4]dioxino[2,3-f]quinoline | CHEMBL559579
Type:
Small organic molecule
Emp. Form.:
C26H25ClN4O2
Mol. Mass.:
460.955
SMILES:
Cc1ccc2c3O[C@@H](CN4CCN(CC4)c4ccc5cc(Cl)ccc5n4)COc3ccc2n1
: