Target
Sodium-dependent serotonin transporter
Ligand
BDBM50295057
Substrate
Meas. Tech.
ChEMBL_574190 (CHEMBL1060391)
Ki
89.6±n/a nM
Citation
 Zhou, DStack, GPLo, JFailli, AAEvrard, DAHarrison, BLHatzenbuhler, NTTran, MCroce, SYi, SGolembieski, JHornby, GALai, MLin, QSchechter, LESmith, DLShilling, ADHuselton, CMitchell, PBeyer, CEAndree, TH Synthesis, potency, and in vivo evaluation of 2-piperazin-1-ylquinoline analogues as dual serotonin reuptake inhibitors and serotonin 5-HT1A receptor antagonists. J Med Chem 52:4955-9 (2009)  
Target
Name:
Sodium-dependent serotonin transporter
Synonyms:
5-HT Transporter 5HT transporter Anandamid membrane transporter, AMT Monoamine transporters; Norepinephrine & serotonin Slc6a4 Sodium-dependent serotonin transporter (SERT) | imipramine receptor
Type:
Multi-pass membrane protein
Mol. Mass.:
70168.43
Organism:
Rattus norvegicus (rat)
Description:
P31652
Residue:
630
  
Inhibitor
Name:
BDBM50295057
Synonyms:
2-((3R)-3-Methyl-4-{[(2S)-8-methyl-2,3-dihydro[1,4]dioxino[2,3-f]quinolin-2-yl]methyl}pipera-zin-1-yl)quinoline-6-carbonitrile | CHEMBL560170
Type:
Small organic molecule
Emp. Form.:
C28H27N5O2
Mol. Mass.:
465.5463
SMILES:
C[C@@H]1CN(CCN1C[C@H]1COc2ccc3nc(C)ccc3c2O1)c1ccc2cc(ccc2n1)C#N
: