Target
Interleukin-8
Ligand
BDBM50295267
Substrate
Meas. Tech.
ChEMBL_577736 (CHEMBL1052371)
IC50
12±n/a nM
Citation
 Sablone, MRCesta, MCMoriconi, AAramini, ABizzarri, CDi Giacinto, CDi Bitondo, RGloaguen, IAschi, MCrucianelli, MBertini, RAllegretti, M Structure-Activity Relationship of novel phenylacetic CXCR1 inhibitors. Bioorg Med Chem Lett 19:4026-30 (2009)  
Target
Name:
Interleukin-8
Synonyms:
CXCL8 IL8_HUMAN interleukin 8 precursor
Type:
PROTEIN
Mol. Mass.:
11104.05
Organism:
Homo sapiens (Human)
Description:
ChEMBL_577736
Residue:
99
  
Inhibitor
Name:
BDBM50295267
Synonyms:
2-{2-[(2,6-Dichlorophenyl)amino]phenyl}propanamide | CHEMBL553416
Type:
Small organic molecule
Emp. Form.:
C15H14Cl2N2O
Mol. Mass.:
309.19
SMILES:
CC(C(N)=O)c1ccccc1Nc1c(Cl)cccc1Cl
: