Target
Glycogen phosphorylase, muscle form
Ligand
BDBM50263722
Substrate
Meas. Tech.
ChEMBL_578476 (CHEMBL1063135)
Ki
444000±n/a nM
Citation
 Tóth, MKun, SBokor, EBenltifa, MTallec, GVidal, SDocsa, TGergely, PSomsák, LPraly, JP Synthesis and structure-activity relationships of C-glycosylated oxadiazoles as inhibitors of glycogen phosphorylase. Bioorg Med Chem 17:4773-85 (2009)  
Target
Name:
Glycogen phosphorylase, muscle form
Synonyms:
Glycogen Phosphorylase (PYGM) Glycogen phosphorylase, muscle form PYGM | PYGM_RABIT
Type:
Enzyme
Mol. Mass.:
97296.32
Organism:
Oryctolagus cuniculus (rabbit)
Description:
Phosphorylation of Ser-15 converts phosphorylase B (unphosphorylated) to phosphorylase A.
Residue:
843
  
Inhibitor
Name:
BDBM50263722
Synonyms:
CHEMBL450104 N-((2R,3R,4S,5S,6R)-3,4,5-trihydroxy-6-(hydroxymethyl)tetrahydro-2H-pyran-2-yl)-1-naphthamide
Type:
Small organic molecule
Emp. Form.:
C17H19NO6
Mol. Mass.:
333.3359
SMILES:
OC[C@H]1O[C@@H](NC(=O)c2cccc3ccccc23)[C@H](O)[C@@H](O)[C@@H]1O
: