Target
Metabotropic glutamate receptor 1
Ligand
BDBM50296668
Substrate
Meas. Tech.
ChEMBL_582382 (CHEMBL1063419)
Ki
9180±n/a nM
Citation
 Noeske, TTrifanova, DKauss, VRenner, SParsons, CGSchneider, GWeil, T Synergism of virtual screening and medicinal chemistry: identification and optimization of allosteric antagonists of metabotropic glutamate receptor 1. Bioorg Med Chem 17:5708-15 (2009)  
Target
Name:
Metabotropic glutamate receptor 1
Synonyms:
GRM1_RAT Grm1 Metabotropic glutamate receptor Mglur1 metabotropic glutamate 1/5-D metabotropic glutamate receptor 1 isoform alpha precursor
Type:
Enzyme Catalytic Domain
Mol. Mass.:
133240.47
Organism:
RAT
Description:
metabotropic glutamate 1/2 0 RAT::P23385
Residue:
1199
  
Inhibitor
Name:
BDBM50296668
Synonyms:
3-(2-chloro-6-methylquinolin-3-yl)-1-phenylprop-2-en-1-one | CHEMBL559243
Type:
Small organic molecule
Emp. Form.:
C19H14ClNO
Mol. Mass.:
307.774
SMILES:
Cc1ccc2nc(Cl)c(\C=C\C(=O)c3ccccc3)cc2c1
: