Target
Metabotropic glutamate receptor 1
Ligand
BDBM50296689
Substrate
Meas. Tech.
ChEMBL_582382 (CHEMBL1063419)
Ki
>40000±n/a nM
Citation
 Noeske, TTrifanova, DKauss, VRenner, SParsons, CGSchneider, GWeil, T Synergism of virtual screening and medicinal chemistry: identification and optimization of allosteric antagonists of metabotropic glutamate receptor 1. Bioorg Med Chem 17:5708-15 (2009)  
Target
Name:
Metabotropic glutamate receptor 1
Synonyms:
GRM1_RAT Grm1 Metabotropic glutamate receptor Mglur1 metabotropic glutamate 1/5-D metabotropic glutamate receptor 1 isoform alpha precursor
Type:
Enzyme Catalytic Domain
Mol. Mass.:
133240.47
Organism:
RAT
Description:
metabotropic glutamate 1/2 0 RAT::P23385
Residue:
1199
  
Inhibitor
Name:
BDBM50296689
Synonyms:
(4-(4-bromobenzylideneamino)phenyl)(phenyl)methanone | CHEMBL555029
Type:
Small organic molecule
Emp. Form.:
C20H14BrNO
Mol. Mass.:
364.235
SMILES:
Brc1ccc(\C=N\c2ccc(cc2)C(=O)c2ccccc2)cc1
: