Target
Metabotropic glutamate receptor 1
Ligand
BDBM50296683
Substrate
Meas. Tech.
ChEMBL_582387 (CHEMBL1063424)
IC50
22500±n/a nM
Citation
 Noeske, TTrifanova, DKauss, VRenner, SParsons, CGSchneider, GWeil, T Synergism of virtual screening and medicinal chemistry: identification and optimization of allosteric antagonists of metabotropic glutamate receptor 1. Bioorg Med Chem 17:5708-15 (2009)  
Target
Name:
Metabotropic glutamate receptor 1
Synonyms:
GRM1_RAT Grm1 Metabotropic glutamate receptor Mglur1 metabotropic glutamate 1/5-D metabotropic glutamate receptor 1 isoform alpha precursor
Type:
Enzyme Catalytic Domain
Mol. Mass.:
133240.47
Organism:
RAT
Description:
metabotropic glutamate 1/2 0 RAT::P23385
Residue:
1199
  
Inhibitor
Name:
BDBM50296683
Synonyms:
4-(5-pentylpyridin-2-yl)phenyl 4-ethylcyclohexanecarboxylate | CHEMBL564000
Type:
Small organic molecule
Emp. Form.:
C25H33NO2
Mol. Mass.:
379.535
SMILES:
CCCCCc1ccc(nc1)-c1ccc(OC(=O)C2CCC(CC)CC2)cc1
: