Target
Metabotropic glutamate receptor 1
Ligand
BDBM50296679
Substrate
Meas. Tech.
ChEMBL_582382 (CHEMBL1063419)
Ki
304±n/a nM
Citation
 Noeske, TTrifanova, DKauss, VRenner, SParsons, CGSchneider, GWeil, T Synergism of virtual screening and medicinal chemistry: identification and optimization of allosteric antagonists of metabotropic glutamate receptor 1. Bioorg Med Chem 17:5708-15 (2009)  
Target
Name:
Metabotropic glutamate receptor 1
Synonyms:
GRM1_RAT Grm1 Metabotropic glutamate receptor Mglur1 metabotropic glutamate 1/5-D metabotropic glutamate receptor 1 isoform alpha precursor
Type:
Enzyme Catalytic Domain
Mol. Mass.:
133240.47
Organism:
RAT
Description:
metabotropic glutamate 1/2 0 RAT::P23385
Residue:
1199
  
Inhibitor
Name:
BDBM50296679
Synonyms:
Adamantan-1-yl-[2-(6-methoxy-pyridin-3-yl)-cyclopropyl]-methanone | CHEMBL551469
Type:
Small organic molecule
Emp. Form.:
C20H25NO2
Mol. Mass.:
311.418
SMILES:
COc1ccc(cn1)C1CC1C(=O)C12CC3CC(CC(C3)C1)C2
: