Target
Metabotropic glutamate receptor 5
Ligand
BDBM50296673
Substrate
Meas. Tech.
ChEMBL_582383 (CHEMBL1063420)
Ki
30590±n/a nM
Citation
 Noeske, TTrifanova, DKauss, VRenner, SParsons, CGSchneider, GWeil, T Synergism of virtual screening and medicinal chemistry: identification and optimization of allosteric antagonists of metabotropic glutamate receptor 1. Bioorg Med Chem 17:5708-15 (2009)  
Target
Name:
Metabotropic glutamate receptor 5
Synonyms:
GRM5_RAT Grm5 Mglur5 metabotropic glutamate 5/1-C metabotropic glutamate 5a
Type:
Enzyme
Mol. Mass.:
131900.14
Organism:
Rattus norvegicus (Rat)
Description:
P31424
Residue:
1203
  
Inhibitor
Name:
BDBM50296673
Synonyms:
(E)-4,4-Dimethyl-1-quinolin-3-yl-pent-1-en-3-one | CHEMBL572128
Type:
Small organic molecule
Emp. Form.:
C16H17NO
Mol. Mass.:
239.3123
SMILES:
CC(C)(C)C(=O)\C=C\c1cnc2ccccc2c1
: