Target
Prostaglandin E2 receptor EP4 subtype
Ligand
BDBM50296848
Substrate
Meas. Tech.
ChEMBL_582706 (CHEMBL1051803)
IC50
>10000±n/a nM
Citation
 Sandham, DAAdcock, CBala, KBarker, LBrown, ZDubois, GBudd, DCox, BFairhurst, RAFuregati, MLeblanc, CManini, JProfit, RReilly, JStringer, RSchmidt, ATurner, KLWatson, SJWillis, JWilliams, GWilson, C 7-Azaindole-3-acetic acid derivatives: potent and selective CRTh2 receptor antagonists. Bioorg Med Chem Lett 19:4794-8 (2009)  
Target
Name:
Prostaglandin E2 receptor EP4 subtype
Synonyms:
PE2R4_HUMAN PGE2 receptor EP4 subtype PTGER4 Prostanoid EP4 receptor
Type:
Enzyme
Mol. Mass.:
53134.53
Organism:
Homo sapiens (Human)
Description:
P35408
Residue:
488
  
Inhibitor
Name:
BDBM50296848
Synonyms:
2-(1-(3,4-difluorophenylsulfonyl)-2-methyl-1H-pyrrolo[2,3-b]pyridin-3-yl)acetic acid | CHEMBL563949
Type:
Small organic molecule
Emp. Form.:
C16H12F2N2O4S
Mol. Mass.:
366.339
SMILES:
Cc1c(CC(O)=O)c2cccnc2n1S(=O)(=O)c1ccc(F)c(F)c1
: