Target
Dual specificity tyrosine-phosphorylation-regulated kinase 1A
Ligand
BDBM50297029
Substrate
Meas. Tech.
ChEMBL_580986 (CHEMBL1057274)
IC50
>10000±n/a nM
Citation
 Chioua, MSamadi, ASoriano, ELozach, OMeijer, LMarco-Contelles, J Synthesis and biological evaluation of 3,6-diamino-1H-pyrazolo[3,4-b]pyridine derivatives as protein kinase inhibitors. Bioorg Med Chem Lett 19:4566-9 (2009)  
Target
Name:
Dual specificity tyrosine-phosphorylation-regulated kinase 1A
Synonyms:
DYR1A_HUMAN DYRK1A Dual specificity YAK1-related kinase 1A (Dyrk1A) Dual-specificity tyrosine-phosphorylation regulated kinase 1A HP86 MNBH
Type:
Enzyme
Mol. Mass.:
85616.61
Organism:
Homo sapiens (Human)
Description:
Q13627
Residue:
763
  
Inhibitor
Name:
BDBM50297029
Synonyms:
3-Amino-6-morpholin-4-yl-4-phenyl-1H-pyrazolo[3,4-b]pyridine-5-carbonitrile | CHEMBL552925
Type:
Small organic molecule
Emp. Form.:
C17H16N6O
Mol. Mass.:
320.3485
SMILES:
Nc1n[nH]c2nc(N3CCOCC3)c(C#N)c(-c3ccccc3)c12
: