Target
Cyclin-dependent kinase 5
Ligand
BDBM50297029
Substrate
Meas. Tech.
ChEMBL_580987 (CHEMBL1057275)
IC50
>10000±n/a nM
Citation
 Chioua, MSamadi, ASoriano, ELozach, OMeijer, LMarco-Contelles, J Synthesis and biological evaluation of 3,6-diamino-1H-pyrazolo[3,4-b]pyridine derivatives as protein kinase inhibitors. Bioorg Med Chem Lett 19:4566-9 (2009)  
Target
Name:
Cyclin-dependent kinase 5
Synonyms:
CDK5 CDKN5 Cyclin-dependent kinase 5 (CDK5/ p25) Cyclin-dependent-like kinase 5 PSSALRE Tau protein kinase II catalytic subunit
Type:
Enzyme Subunit
Mol. Mass.:
33308.61
Organism:
Homo sapiens (Human)
Description:
Residue:
292
  
Inhibitor
Name:
BDBM50297029
Synonyms:
3-Amino-6-morpholin-4-yl-4-phenyl-1H-pyrazolo[3,4-b]pyridine-5-carbonitrile | CHEMBL552925
Type:
Small organic molecule
Emp. Form.:
C17H16N6O
Mol. Mass.:
320.3485
SMILES:
Nc1n[nH]c2nc(N3CCOCC3)c(C#N)c(-c3ccccc3)c12
: