Target
Cyclin-dependent kinase 5
Ligand
BDBM50297036
Substrate
Meas. Tech.
ChEMBL_580987 (CHEMBL1057275)
IC50
>10000±n/a nM
Citation
 Chioua, MSamadi, ASoriano, ELozach, OMeijer, LMarco-Contelles, J Synthesis and biological evaluation of 3,6-diamino-1H-pyrazolo[3,4-b]pyridine derivatives as protein kinase inhibitors. Bioorg Med Chem Lett 19:4566-9 (2009)  
Target
Name:
Cyclin-dependent kinase 5
Synonyms:
CDK5 CDKN5 Cyclin-dependent kinase 5 (CDK5/ p25) Cyclin-dependent-like kinase 5 PSSALRE Tau protein kinase II catalytic subunit
Type:
Enzyme Subunit
Mol. Mass.:
33308.61
Organism:
Homo sapiens (Human)
Description:
Residue:
292
  
Inhibitor
Name:
BDBM50297036
Synonyms:
3,6-diamino-2-phenyl-2H-pyrazolo[3,4-b]pyridine-5-carbonitrile | CHEMBL557120
Type:
Small organic molecule
Emp. Form.:
C13H10N6
Mol. Mass.:
250.2587
SMILES:
Nc1n(nc2nc(N)c(cc12)C#N)-c1ccccc1
: