Target
Mu-type opioid receptor
Ligand
BDBM50297301
Substrate
Meas. Tech.
ChEMBL_582957 (CHEMBL1055013)
Ki
0.077±n/a nM
Citation
 Balboni, GTrapella, CSasaki, YAmbo, AMarczak, EDLazarus, LHSalvadori, S Influence of the side chain next to C-terminal benzimidazole in opioid pseudopeptides containing the Dmt-Tic pharmacophore. J Med Chem 52:5556-9 (2009)  
Target
Name:
Mu-type opioid receptor
Synonyms:
MOR-1 Mu-type opioid receptor (MOR) OPRM_RAT Opioid receptor B Ror-b
Type:
G Protein-Coupled Receptor (GPCR)
Mol. Mass.:
44503.11
Organism:
Rattus norvegicus (rat)
Description:
Competition binding assays were carried out using membrane preparations from transfected HN9.10 cells that constitutively expressed the mu opioid receptor.
Residue:
398
  
Inhibitor
Name:
BDBM50297301
Synonyms:
(S)-1H-benzo[d]imidazol-2-yl 3-acetoxy-2-((S)-2-((S)-2-amino-3-(4-hydroxy-2,6-dimethylphenyl)propanoyl)-1,2,3,4-tetrahydroisoquinoline-3-carboxamido)propanoate | CHEMBL557346
Type:
Small organic molecule
Emp. Form.:
C33H35N5O6
Mol. Mass.:
597.6609
SMILES:
CC(=O)OC[C@H](NC(=O)[C@@H]1Cc2ccccc2CN1C(=O)[C@@H](N)Cc1c(C)cc(O)cc1C)C(=O)c1nc2ccccc2[nH]1
: