Target
Delta-type opioid receptor
Ligand
BDBM50297288
Substrate
Meas. Tech.
ChEMBL_582960 (CHEMBL1055016)
IC50
0.12±n/a nM
Citation
 Balboni, GTrapella, CSasaki, YAmbo, AMarczak, EDLazarus, LHSalvadori, S Influence of the side chain next to C-terminal benzimidazole in opioid pseudopeptides containing the Dmt-Tic pharmacophore. J Med Chem 52:5556-9 (2009)  
Target
Name:
Delta-type opioid receptor
Synonyms:
DOR-1 MSL-2 OPRD_MOUSE Oprd1
Type:
Enzyme Catalytic Domain
Mol. Mass.:
40577.25
Organism:
MOUSE
Description:
P32300
Residue:
372
  
Inhibitor
Name:
BDBM50297288
Synonyms:
(S)-4-(1H-benzo[d]imidazol-2-yloxy)-3-((S)-2-((S)-2-amino-3-(4-hydroxy-2,6-dimethylphenyl)propanoyl)-1,2,3,4-tetrahydroisoquinoline-3-carboxamido)-4-oxobutanoic acid | CHEMBL540972
Type:
Small organic molecule
Emp. Form.:
C32H33N5O6
Mol. Mass.:
583.6343
SMILES:
Cc1cc(O)cc(C)c1C[C@H](N)C(=O)N1Cc2ccccc2C[C@H]1C(=O)N[C@@H](CC(O)=O)C(=O)c1nc2ccccc2[nH]1
: