Target
Proto-oncogene tyrosine-protein kinase Src
Ligand
BDBM50224388
Substrate
Meas. Tech.
ChEMBL_583405 (CHEMBL1056606)
Ki
1800±n/a nM
Citation
 Dreassi, EZizzari, ATFalchi, FSchenone, SSantucci, AMaga, GBotta, M Determination of permeability and lipophilicity of pyrazolo-pyrimidine tyrosine kinase inhibitors and correlation with biological data. Eur J Med Chem 44:3712-7 (2009)  
Target
Name:
Proto-oncogene tyrosine-protein kinase Src
Synonyms:
Calmodulin/Proto-oncogene tyrosine-protein kinase Src Proto-oncogene c-Src SRC SRC_HUMAN V-src sarcoma (Schmidt-Ruppin A-2) viral oncogene homolog (avian) p60-Src | pp60c-src
Type:
Protein
Mol. Mass.:
59838.60
Organism:
Homo sapiens (Human)
Description:
P12931
Residue:
536
  
Inhibitor
Name:
BDBM50224388
Synonyms:
CHEMBL238561 | N-(3-bromophenyl)-1-(2-chloro-2-phenylethyl)-6-(methylthio)-1H-pyrazolo[3,4-d]pyrimidin-4-amine
Type:
Small organic molecule
Emp. Form.:
C20H17BrClN5S
Mol. Mass.:
474.804
SMILES:
CSc1nc(Nc2cccc(Br)c2)c2cnn(CC(Cl)c3ccccc3)c2n1
: