Target
Prostaglandin G/H synthase 1
Ligand
BDBM50297559
Substrate
Meas. Tech.
ChEMBL_583548 (CHEMBL1059063)
IC50
52300±n/a nM
Citation
 Husain, AAhmad, AAlam, MMAjmal, MAhuja, P Fenbufen based 3-[5-(substituted aryl)-1,3,4-oxadiazol-2-yl]-1-(biphenyl-4-yl)propan-1-ones as safer antiinflammatory and analgesic agents. Eur J Med Chem 44:3798-804 (2009)  
Target
Name:
Prostaglandin G/H synthase 1
Synonyms:
COX1 Cyclooxygenase-1 (COX-1) PTGS1 | Prostaglandin G/H synthase (cyclooxygenase)
Type:
Protein
Mol. Mass.:
68868.60
Organism:
Ovis aries (Sheep)
Description:
Residue:
600
  
Inhibitor
Name:
BDBM50297559
Synonyms:
3-[5-(4-Methoxyophenyl)-1,3,4-oxadiazol-2-yl]-1-(biphenyl-4-yl)propan-1-one | CHEMBL559421
Type:
Small organic molecule
Emp. Form.:
C24H20N2O3
Mol. Mass.:
384.4272
SMILES:
COc1ccc(cc1)-c1nnc(CCC(=O)c2ccc(cc2)-c2ccccc2)o1
: