Target
C-X-C chemokine receptor type 2
Ligand
BDBM50297761
Substrate
Meas. Tech.
ChEMBL_584049 (CHEMBL1055929)
Ki
4±n/a nM
Citation
 Aki, CChao, JFerreira, JADwyer, MPYu, YChao, JMerritt, RJLai, GWu, MHipkin, RWFan, XGonsiorek, WFosseta, JRindgen, DFine, JLundell, DTaveras, AGBiju, P Diaminocyclobutenediones as potent and orally bioavailable CXCR2 receptor antagonists: SAR in the phenolic amide region. Bioorg Med Chem Lett 19:4446-9 (2009)  
Target
Name:
C-X-C chemokine receptor type 2
Synonyms:
C-X-C chemokine receptor type 2 (CXCR-2) CD_antigen=CD182 CXCR-2 CXCR2_HUMAN GRO/MGSA receptor IL-8 receptor type 2 IL8RB | Interleukin-8 receptor B
Type:
Protein
Mol. Mass.:
40767.88
Organism:
Homo sapiens (Human)
Description:
P25025
Residue:
360
  
Inhibitor
Name:
BDBM50297761
Synonyms:
(R)-6-bromo-3-(3,4-dioxo-2-(1-phenylpropylamino)cyclobut-1-enylamino)-2-hydroxy-N,N-dimethylbenzamide | CHEMBL557466
Type:
Small organic molecule
Emp. Form.:
C22H22BrN3O4
Mol. Mass.:
472.332
SMILES:
CC[C@@H](Nc1c(Nc2ccc(Br)c(C(=O)N(C)C)c2O)c(=O)c1=O)c1ccccc1
: