Target
Ephrin type-B receptor 2
Ligand
BDBM50297825
Substrate
Meas. Tech.
ChEMBL_584287 (CHEMBL1060003)
EC50
40±n/a nM
Citation
 Choi, YSyeda, FWalker, JRFinerty, PJCuerrier, DWojciechowski, ALiu, QDhe-Paganon, SGray, NS Discovery and structural analysis of Eph receptor tyrosine kinase inhibitors. Bioorg Med Chem Lett 19:4467-70 (2009)  
Target
Name:
Ephrin type-B receptor 2
Synonyms:
DRT ELK-related tyrosine kinase EPH-like kinase 5 EPHB2_HUMAN EPTH3 Ephrin receptor TYRO5
Type:
PROTEIN
Mol. Mass.:
117491.44
Organism:
Homo sapiens (Human)
Description:
ChEMBL_1476221
Residue:
1055
  
Inhibitor
Name:
BDBM50297825
Synonyms:
5-(2-methyl-5-(3-(trifluoromethyl)phenylcarbamoyl)phenylamino)nicotinamide 5-[(2-methyl-5-{[3-(trifluoromethyl)phenyl]carbamoyl}phenyl)amino]pyridine-3-carboxamide | CHEMBL552425
Type:
Small organic molecule
Emp. Form.:
C21H17F3N4O2
Mol. Mass.:
414.3805
SMILES:
Cc1ccc(cc1Nc1cncc(c1)C(N)=O)C(=O)Nc1cccc(c1)C(F)(F)F
: