Target
Adenosine receptor A3
Ligand
BDBM50051241
Substrate
Meas. Tech.
ChEMBL_587704 (CHEMBL1037718)
Ki
>10000±n/a nM
Citation
 Michielan, LBolcato, CFederico, SCacciari, BBacilieri, MKlotz, KNKachler, SPastorin, GCardin, RSperduti, ASpalluto, GMoro, S Combining selectivity and affinity predictions using an integrated Support Vector Machine (SVM) approach: An alternative tool to discriminate between the human adenosine A(2A) and A(3) receptor pyrazolo-triazolo-pyrimidine antagonists binding sites. Bioorg Med Chem 17:5259-74 (2009)  
Target
Name:
Adenosine receptor A3
Synonyms:
A3 adenosine receptor (hA3) ADORA3 | Adenosine A3 receptor (A3AR)
Type:
G Protein-Coupled Receptor (GPCR)
Mol. Mass.:
36197.32
Organism:
Homo sapiens (Human)
Description:
P0DMS8
Residue:
318
  
Inhibitor
Name:
BDBM50051241
Synonyms:
2-(furan-2-yl)-7-(3-phenylpropyl)-7H-pyrazolo[4,3-e][1,2,4]triazolo[1,5-c]pyrimidin-5-amine 2-Furan-2-yl-7-(3-phenyl-propyl)-7H-pyrazolo[4,3-e][1,2,4]triazolo[1,5-c]pyrimidin-5-ylamine(SCH 63390) SCH-63390
Type:
Small organic molecule
Emp. Form.:
C19H17N7O
Mol. Mass.:
359.3846
SMILES:
Nc1nc2n(CCCc3ccccc3)ncc2c2nc(nn12)-c1ccco1
: