Target
Ephrin type-A receptor 7
Ligand
BDBM50299218
Substrate
Meas. Tech.
ChEMBL_592568 (CHEMBL1046775)
IC50
1118±n/a nM
Citation
 Lafleur, KHuang, DZhou, TCaflisch, ANevado, C Structure-based optimization of potent and selective inhibitors of the tyrosine kinase erythropoietin producing human hepatocellular carcinoma receptor B4 (EphB4). J Med Chem 52:6433-46 (2009)  
Target
Name:
Ephrin type-A receptor 7
Synonyms:
2.7.10.1 EHK3 EPH homology kinase 3 EPHA7 Ephrin receptor Tyrosine Kinase EPHA6 | Tyrosine Kinase EPHA7
Type:
Mol. Mass.:
112085.32
Organism:
Homo sapiens (Human)
Description:
Residue:
998
  
Inhibitor
Name:
BDBM50299218
Synonyms:
8-(2-Methoxyphenyl)-1-methyl-7-(2'-methyl-5'-hydroxyphenyl-1H-imidazo[2,1-f]purine-2,4(3H,8H)-dione Cpd66
Type:
Small organic molecule
Emp. Form.:
C22H19N5O4
Mol. Mass.:
417.4174
SMILES:
COc1ccccc1-n1c(cn2c1nc1n(C)c(=O)[nH]c(=O)c21)-c1cc(O)ccc1C
: