Target
Ephrin type-B receptor 3
Ligand
BDBM50299218
Substrate
Meas. Tech.
ChEMBL_592572 (CHEMBL1046779)
IC50
15±n/a nM
Citation
 Lafleur, KHuang, DZhou, TCaflisch, ANevado, C Structure-based optimization of potent and selective inhibitors of the tyrosine kinase erythropoietin producing human hepatocellular carcinoma receptor B4 (EphB4). J Med Chem 52:6433-46 (2009)  
Target
Name:
Ephrin type-B receptor 3
Synonyms:
EPHB3 ETK2 Ephrin type-B receptor 3 HEK2 Tyrosine Kinase EPHB3
Type:
Protein
Mol. Mass.:
110326.17
Organism:
Homo sapiens (Human)
Description:
P54753
Residue:
998
  
Inhibitor
Name:
BDBM50299218
Synonyms:
8-(2-Methoxyphenyl)-1-methyl-7-(2'-methyl-5'-hydroxyphenyl-1H-imidazo[2,1-f]purine-2,4(3H,8H)-dione Cpd66
Type:
Small organic molecule
Emp. Form.:
C22H19N5O4
Mol. Mass.:
417.4174
SMILES:
COc1ccccc1-n1c(cn2c1nc1n(C)c(=O)[nH]c(=O)c21)-c1cc(O)ccc1C
: