Target
Alkaline phosphatase, tissue-nonspecific isozyme
Ligand
BDBM50299541
Substrate
Meas. Tech.
ChEMBL_591437 (CHEMBL1054557)
IC50
>10000±n/a nM
Citation
 Dahl, RSergienko, EASu, YMostofi, YSYang, LSimao, AMNarisawa, SBrown, BMangravita-Novo, AVicchiarelli, MSmith, LHO'Neill, WCMillán, JLCosford, ND Discovery and validation of a series of aryl sulfonamides as selective inhibitors of tissue-nonspecific alkaline phosphatase (TNAP). J Med Chem 52:6919-25 (2009)  
Target
Name:
Alkaline phosphatase, tissue-nonspecific isozyme
Synonyms:
ALPL tissue-nonspecific alkaline phosphatase precursor
Type:
PROTEIN
Mol. Mass.:
57306.17
Organism:
Homo sapiens (Human)
Description:
ChEMBL_1448917
Residue:
524
  
Inhibitor
Name:
BDBM50299541
Synonyms:
CHEMBL572541 cid_24178164
Type:
Small organic molecule
Emp. Form.:
C17H16N2O4S
Mol. Mass.:
344.385
SMILES:
COc1ccc(OC)c(NS(=O)(=O)c2cnc3ccccc3c2)c1
: